Target
Metabotropic glutamate receptor 5
Ligand
BDBM104731
Substrate
Meas. Tech.
Cell Based Assay
IC50
89±0.0 nM
Citation
 Conn, PJLindsley, CWEmmitte, KAWeaver, CDRodriguez, ALFelts, ASJones, CKBates, BS Substituted heteroarylamine carboxamide analogs as mGluR5 negative allosteric modulators and methods of making and using the same US Patent  US8569308 Publication Date 10/29/2013 
Target
Name:
Metabotropic glutamate receptor 5
Synonyms:
GPRC1E GRM5_HUMAN metabotropic glutamate 5 | metabotropic glutamate 5a
Type:
Enzyme
Mol. Mass.:
132484.72
Organism:
Homo sapiens (Human)
Description:
Residue:
1212
  
Inhibitor
Name:
BDBM104731
Synonyms:
US8569308, 224 | US8569308, Unnumbered 20
Type:
Small organic molecule
Emp. Form.:
C16H11ClN4O2
Mol. Mass.:
326.737
SMILES:
Clc1cccc(c1)C(=O)Nc1cccc(Oc2cncnc2)n1
: