Target
Prostaglandin E2 receptor EP1 subtype
Ligand
BDBM119458
Substrate
Meas. Tech.
Cell Response Assay
IC50
11±n/a nM
Citation
 Tatani, KKawamura, NKondo, TKondo, A Indole derivative or pharmaceutically acceptable salt thereof US Patent  US8680120 Publication Date 3/25/2014 
Target
Name:
Prostaglandin E2 receptor EP1 subtype
Synonyms:
PE2R1_RAT Ptger1
Type:
Enzyme
Mol. Mass.:
43080.10
Organism:
Rattus norvegicus (Rat)
Description:
P70597
Residue:
405
  
Inhibitor
Name:
BDBM119458
Synonyms:
US8680120, 9-32
Type:
Small organic molecule
Emp. Form.:
C21H17NO4
Mol. Mass.:
347.364
SMILES:
COc1ccc2n(Cc3cccc(c3)C(O)=O)c(cc2c1)-c1ccoc1
: