Target
cAMP and cAMP-inhibited cGMP 3',5'-cyclic phosphodiesterase 10A
Ligand
BDBM124494
Substrate
Meas. Tech.
Enzyme Inhibition Assay
Temperature
298.15±n/a K
IC50
0.214±n/a nM
Comments
extracted
Citation
 Allen, JRBiswas, KChavez, Jr., FChen, NDe Morin, FFFalsey, JRFrohn, MJHarrington, PEHome, DBHarrington, EHKaller, MRKunz, RKMonenschein, HNguyen, TTPickrell, AJReichelt, ARumfelt, SRzasa, RMSham, KYao, G Pyridine and pyrimidine derivatives as phosphodiesterase 10 inhibitors US Patent  US8759532 Publication Date 6/24/2014 
Target
Name:
cAMP and cAMP-inhibited cGMP 3',5'-cyclic phosphodiesterase 10A
Synonyms:
3',5'-cyclic phosphodiesterase PDE10A Phosphodiesterase 10 (PDE10) | Phosphodiesterase 10A
Type:
Protein
Mol. Mass.:
88412.52
Organism:
Homo sapiens (Human)
Description:
Q9Y233
Residue:
1055
  
Inhibitor
Name:
BDBM124494
Synonyms:
US8759532, 168
Type:
Small organic molecule
Emp. Form.:
C26H22N4O3
Mol. Mass.:
438.4779
SMILES:
CC(=O)N1CCCC(=C1)c1cccnc1Oc1ccc(cc1)C(=O)c1nc2ccccc2[nH]1
: