Target
Phosphatidylinositol 4,5-bisphosphate 3-kinase catalytic subunit alpha isoform
Ligand
BDBM50394838
Substrate
Meas. Tech.
Alphascreen Assay
Ki
2±n/a nM
Citation
 Andrews, KLBo, YYBooker, SCee, VJD'Angelo, NHerberich, BJHong, FJackson, CLLanman, BALiao, HLiu, LNishimura, NNorman, MHPettus, LHReed, ABSmith, ALTadesse, STamayo, NAWu, BWurz, RYang, KC Inhibitors of PI3 kinase and/or mTOR US Patent  US8772480 Publication Date 7/8/2014 
Target
Name:
Phosphatidylinositol 4,5-bisphosphate 3-kinase catalytic subunit alpha isoform
Synonyms:
P42336 PI3-kinase subunit p110-alpha PIK3CA Phosphatidylinositol 3-kinase alpha (PI3Kalpha) Phosphatidylinositol 4,5-bisphosphate 3-kinase (PI3K) Phosphatidylinositol 4,5-bisphosphate 3-kinase catalytic subunit alpha (PI3Kalpha) Phosphatidylinositol 4,5-bisphosphate 3-kinase catalytic subunit alpha isoform (PI3-Ka) Phosphatidylinositol 4,5-bisphosphate 3-kinase catalytic subunit alpha isoform (PI3K p110alpha) Phosphatidylinositol 4,5-bisphosphate 3-kinase catalytic subunit alpha isoform (PI3K-alpha) Phosphatidylinositol 4,5-bisphosphate 3-kinase catalytic subunit alpha isoform (PI3Kalpha p110alpha) Phosphatidylinositol 4,5-bisphosphate 3-kinase catalytic subunit alpha isoform (PIK3CA) Phosphatidylinositol-4,5-bisphosphate 3-kinase catalytic subunit alpha isoform Phosphoinositide 3-Kinase (PI3K), alpha Chain A Phosphoinositide 3-kinases (PI3K) PtdIns-3-kinase p110 | p110 alpha
Type:
Enzyme Subunit
Mol. Mass.:
124294.87
Organism:
Homo sapiens (Human)
Description:
P42336
Residue:
1068
  
Inhibitor
Name:
BDBM50394838
Synonyms:
CHEMBL2165007 | US8772480, 141
Type:
Small organic molecule
Emp. Form.:
C23H23N7O3S
Mol. Mass.:
477.539
SMILES:
COc1ccc(Nc2ncc(Cc3ccc(cc3)S(C)(=O)=O)cc2-c2nc(C)nc(N)n2)cn1
: