Target
Serine/threonine-protein kinase mTOR
Ligand
BDBM50394838
Substrate
Meas. Tech.
In Vitro Inhibition Assay
IC50
>10000±n/a nM
Citation
 Andrews, KLBo, YYBooker, SCee, VJD'Angelo, NHerberich, BJHong, FJackson, CLLanman, BALiao, HLiu, LNishimura, NNorman, MHPettus, LHReed, ABSmith, ALTadesse, STamayo, NAWu, BWurz, RYang, KC Inhibitors of PI3 kinase and/or mTOR US Patent  US8772480 Publication Date 7/8/2014 
Target
Name:
Serine/threonine-protein kinase mTOR
Synonyms:
FK506-binding protein 12-rapamycin complex-associated protein 1 FRAP FRAP1 MTOR Mammalian Target of Rapamycin (mTOR) RAFT1 Rapamycin and FKBP12 target 1 Serine/threonine-protein kinase (mTOR) | mTORC2
Type:
Rapamycin target protein
Mol. Mass.:
288917.12
Organism:
Homo sapiens (Human)
Description:
P42345
Residue:
2549
  
Inhibitor
Name:
BDBM50394838
Synonyms:
CHEMBL2165007 | US8772480, 141
Type:
Small organic molecule
Emp. Form.:
C23H23N7O3S
Mol. Mass.:
477.539
SMILES:
COc1ccc(Nc2ncc(Cc3ccc(cc3)S(C)(=O)=O)cc2-c2nc(C)nc(N)n2)cn1
: