Target
Somatostatin receptor type 5
Ligand
BDBM144786
Substrate
Meas. Tech.
Radioligand Binding Assay
pH
7.6±n/a
Temperature
298.15±n/a K
Ki
1.38±n/a nM
Comments
extracted
Citation
 Dong, ZXShen, YKim, SH Somatostatin-dopamine chimeric analogs US Patent  US8952128 Publication Date 2/10/2015 
Target
Name:
Somatostatin receptor type 5
Synonyms:
SOMATOSTATIN SST5 SS5-R SSR5_HUMAN Somatostatin receptor type 5 (SSTR5)
Type:
Enzyme
Mol. Mass.:
39218.02
Organism:
Homo sapiens (Human)
Description:
P35346
Residue:
364
  
Inhibitor
Name:
BDBM144786
Synonyms:
US8952128, 44
Type:
Small organic molecule
Emp. Form.:
C78H100N16O10S
Mol. Mass.:
1453.795
SMILES:
C[C@@H](O)C1NC(=O)[C@H](CCCCN)NC(=O)[C@@H](Cc2c[nH]c3ccccc23)NC(=O)[C@H](Cc2ccccc2)NC(=O)[C@H](Cc2ccccc2)NC(=O)[C@H](CCCNC(N)=N)NC(=O)[C@@H](CCCCNC(=O)[C@H](Cc2ccccc2)NC1=O)NC(=O)CSC[C@@H]1C[C@H]2[C@@H](Cc3c[nH]c4cccc2c34)N(C)C1
: