Target
Transient receptor potential cation channel subfamily V member 3
Ligand
BDBM155805
Substrate
Meas. Tech.
Calcium Flux Assay
IC50
350±n/a nM
Citation
 Clapham, BCox, PBDart, MJGomtsyan, AJinkerson, TKKeddy, RGKort, MEKym, PRMatulenko, MSchmidt, RGVillamil, CIVoight, EAWoller, KR TRPV3 modulators US Patent  US9012651 Publication Date 4/21/2015 
Target
Name:
Transient receptor potential cation channel subfamily V member 3
Synonyms:
TRPV3 Transient receptor potential cation channel subfamily V member 3 (TRPV3) | Vanilloid receptor-like 3
Type:
Enzyme
Mol. Mass.:
90635.51
Organism:
Homo sapiens (Human)
Description:
Q8NET8
Residue:
790
  
Inhibitor
Name:
BDBM155805
Synonyms:
US9012651, 249
Type:
Small organic molecule
Emp. Form.:
C20H24FN3O
Mol. Mass.:
341.4225
SMILES:
CC(C)[C@H](CO)NCc1nc(ccc1F)-c1cc2ccccc2n1C
: