Target
ATP-sensitive inward rectifier potassium channel 1
Ligand
BDBM163765
Substrate
Meas. Tech.
Electrophysiology Assay
pH
7.4±n/a
IC50
80±n/a nM
Comments
extracted
Citation
 Pasternak, ABlizzard, TChobanian, Hde Jesus, RDing, FDong, SGude, CKim, DTang, HWalsh, SPio, BJiang, J Inhibitors of the renal outer medullary potassium channel US Patent  US9062070 Publication Date 6/23/2015 
Target
Name:
ATP-sensitive inward rectifier potassium channel 1
Synonyms:
ATP-regulated potassium channel ROM-K Inward rectifier K(+) channel Kir1.1 KCNJ1_RAT Potassium channel (ATP modulatory) Renal Outer Medullary Potassium (ROMK) Romk1 | The Renal Outer Medullary Potassium (ROMK) channel (Kir1.1)
Type:
Enzyme
Mol. Mass.:
44976.27
Organism:
Rattus norvegicus (Rat)
Description:
P35560
Residue:
391
  
Inhibitor
Name:
BDBM163765
Synonyms:
US9062070, 20
Type:
Small organic molecule
Emp. Form.:
C24H22F2N8O2
Mol. Mass.:
492.4807
SMILES:
Fc1ccc([C@@H]2CN3CCN(C[C@@H]3CO2)C(=O)C2CCc3nc(ccc23)-n2cnnn2)c(F)c1[N+]#[C-]
: