Target
Prostaglandin E synthase 2
Ligand
BDBM181960
Substrate
Meas. Tech.
Biochemical Assay
pH
6.8±n/a
IC50
460±n/a nM
Comments
extracted
Citation
 Bylund, JEk, MEGravenfors, YNordvall, GMinidis, AVallin, KSViklund, JHolenz, JVon Berg, SSohn, D Bis-(sulfonylamino) derivatives for use in therapy US Patent  US9145380 Publication Date 9/29/2015 
Target
Name:
Prostaglandin E synthase 2
Synonyms:
C9orf15 PGES2_HUMAN | PTGES2
Type:
Enzyme
Mol. Mass.:
41955.21
Organism:
Homo sapiens (Human)
Description:
Q9H7Z7
Residue:
377
  
Inhibitor
Name:
BDBM181960
Synonyms:
US9145380, 163
Type:
Small organic molecule
Emp. Form.:
C16H14ClN3O5S3
Mol. Mass.:
459.947
SMILES:
NS(=O)(=O)c1ccccc1NS(=O)(=O)c1ccc(OCc2cnc(Cl)s2)cc1
: