Target
Prostaglandin E synthase 2
Ligand
BDBM181974
Substrate
Meas. Tech.
Biochemical Assay
pH
6.8±n/a
IC50
2200±n/a nM
Comments
extracted
Citation
 Bylund, JEk, MEGravenfors, YNordvall, GMinidis, AVallin, KSViklund, JHolenz, JVon Berg, SSohn, D Bis-(sulfonylamino) derivatives for use in therapy US Patent  US9145380 Publication Date 9/29/2015 
Target
Name:
Prostaglandin E synthase 2
Synonyms:
C9orf15 PGES2_HUMAN | PTGES2
Type:
Enzyme
Mol. Mass.:
41955.21
Organism:
Homo sapiens (Human)
Description:
Q9H7Z7
Residue:
377
  
Inhibitor
Name:
BDBM181974
Synonyms:
US9145380, 177
Type:
Small organic molecule
Emp. Form.:
C19H17N3O8S4
Mol. Mass.:
543.614
SMILES:
CNS(=O)(=O)c1ccc2c(c1)-c1cc(ccc1S2(=O)=O)S(=O)(=O)Nc1ccccc1S(N)(=O)=O
: