Target
Prostaglandin E synthase 2
Ligand
BDBM181979
Substrate
Meas. Tech.
Biochemical Assay
pH
6.8±n/a
IC50
520±n/a nM
Comments
extracted
Citation
 Bylund, JEk, MEGravenfors, YNordvall, GMinidis, AVallin, KSViklund, JHolenz, JVon Berg, SSohn, D Bis-(sulfonylamino) derivatives for use in therapy US Patent  US9145380 Publication Date 9/29/2015 
Target
Name:
Prostaglandin E synthase 2
Synonyms:
C9orf15 PGES2_HUMAN | PTGES2
Type:
Enzyme
Mol. Mass.:
41955.21
Organism:
Homo sapiens (Human)
Description:
Q9H7Z7
Residue:
377
  
Inhibitor
Name:
BDBM181979
Synonyms:
US9145380, 182
Type:
Small organic molecule
Emp. Form.:
C16H16ClN3O5S2
Mol. Mass.:
429.898
SMILES:
COc1cc(Cl)ccc1CCS(=O)(=O)Nc1ccc(cc1S(N)(=O)=O)C#N
: