Target
Prostaglandin E synthase 2
Ligand
BDBM181981
Substrate
Meas. Tech.
Biochemical Assay
pH
6.8±n/a
IC50
9600±n/a nM
Comments
extracted
Citation
 Bylund, JEk, MEGravenfors, YNordvall, GMinidis, AVallin, KSViklund, JHolenz, JVon Berg, SSohn, D Bis-(sulfonylamino) derivatives for use in therapy US Patent  US9145380 Publication Date 9/29/2015 
Target
Name:
Prostaglandin E synthase 2
Synonyms:
C9orf15 PGES2_HUMAN | PTGES2
Type:
Enzyme
Mol. Mass.:
41955.21
Organism:
Homo sapiens (Human)
Description:
Q9H7Z7
Residue:
377
  
Inhibitor
Name:
BDBM181981
Synonyms:
US9145380, 184
Type:
Small organic molecule
Emp. Form.:
C19H22N2O5S2
Mol. Mass.:
422.518
SMILES:
CC(C)(O)C#Cc1ccc(CCS(=O)(=O)Nc2ccccc2S(N)(=O)=O)cc1
: