Target
Prostaglandin E synthase 2
Ligand
BDBM181982
Substrate
Meas. Tech.
Biochemical Assay
pH
6.8±n/a
IC50
2500±n/a nM
Comments
extracted
Citation
 Bylund, JEk, MEGravenfors, YNordvall, GMinidis, AVallin, KSViklund, JHolenz, JVon Berg, SSohn, D Bis-(sulfonylamino) derivatives for use in therapy US Patent  US9145380 Publication Date 9/29/2015 
Target
Name:
Prostaglandin E synthase 2
Synonyms:
C9orf15 PGES2_HUMAN | PTGES2
Type:
Enzyme
Mol. Mass.:
41955.21
Organism:
Homo sapiens (Human)
Description:
Q9H7Z7
Residue:
377
  
Inhibitor
Name:
BDBM181982
Synonyms:
US9145380, 185
Type:
Small organic molecule
Emp. Form.:
C18H20N2O4S2
Mol. Mass.:
392.492
SMILES:
CC(C)(C)C#Cc1cccc(c1)S(=O)(=O)Nc1ccccc1S(N)(=O)=O
: