Target
Prostaglandin E synthase 2
Ligand
BDBM182023
Substrate
Meas. Tech.
Biochemical Assay
pH
6.8±n/a
IC50
1300±n/a nM
Comments
extracted
Citation
 Bylund, JEk, MEGravenfors, YNordvall, GMinidis, AVallin, KSViklund, JHolenz, JVon Berg, SSohn, D Bis-(sulfonylamino) derivatives for use in therapy US Patent  US9145380 Publication Date 9/29/2015 
Target
Name:
Prostaglandin E synthase 2
Synonyms:
C9orf15 PGES2_HUMAN | PTGES2
Type:
Enzyme
Mol. Mass.:
41955.21
Organism:
Homo sapiens (Human)
Description:
Q9H7Z7
Residue:
377
  
Inhibitor
Name:
BDBM182023
Synonyms:
US9145380, 226
Type:
Small organic molecule
Emp. Form.:
C15H15ClF2N2O5S2
Mol. Mass.:
440.87
SMILES:
NS(=O)(=O)c1ccc(Cl)cc1NS(=O)(=O)CCc1ccc(OC(F)F)cc1
: