Target
Prostaglandin E synthase 2
Ligand
BDBM182027
Substrate
Meas. Tech.
Biochemical Assay
pH
6.8±n/a
IC50
6100±n/a nM
Comments
extracted
Citation
 Bylund, JEk, MEGravenfors, YNordvall, GMinidis, AVallin, KSViklund, JHolenz, JVon Berg, SSohn, D Bis-(sulfonylamino) derivatives for use in therapy US Patent  US9145380 Publication Date 9/29/2015 
Target
Name:
Prostaglandin E synthase 2
Synonyms:
C9orf15 PGES2_HUMAN | PTGES2
Type:
Enzyme
Mol. Mass.:
41955.21
Organism:
Homo sapiens (Human)
Description:
Q9H7Z7
Residue:
377
  
Inhibitor
Name:
BDBM182027
Synonyms:
US9145380, 230
Type:
Small organic molecule
Emp. Form.:
C13H11Cl2FN2O5S2
Mol. Mass.:
429.271
SMILES:
COc1cc(NS(=O)(=O)c2cccc(Cl)c2Cl)c(cc1F)S(N)(=O)=O
: