Target
Poly [ADP-ribose] polymerase tankyrase-2
Ligand
BDBM191192
Substrate
Meas. Tech.
Biochemical Assay
Temperature
298.15±n/a K
IC50
8±2.6 nM
Comments
extracted
Citation
 Cheung, AKChin, DNFan, JMiller-Moslin, KMShultz, MDSmith, TDTomlinson, RCToure, BVisser, MSChen, Z 2-piperidin-1-yl-acetamide compounds for use as tankyrase inhibitors US Patent  US9181266 Publication Date 11/10/2015 
Target
Name:
Poly [ADP-ribose] polymerase tankyrase-2
Synonyms:
(ARTD6 or PARP5b) Poly [ADP-ribose] polymerase tankyrase-2 TNKL TNKS2_HUMAN Tankyrase 2 Tankyrase-2 Tankyrase-2 (TNKS2)
Type:
Enzyme
Mol. Mass.:
126937.16
Organism:
Homo sapiens (Human)
Description:
Q9H2K2
Residue:
1166
  
Inhibitor
Name:
BDBM191192
Synonyms:
US9181266, 61
Type:
Small organic molecule
Emp. Form.:
C23H25FN4O4
Mol. Mass.:
440.4674
SMILES:
Fc1ccc2C(=O)C3(Cc2c1)CCN(CC(=O)NCc1nc2CCOCc2c(=O)[nH]1)CC3
: