Target
ALK tyrosine kinase receptor
Ligand
BDBM196856
Substrate
Meas. Tech.
Enzyme Inhibition Assay
pH
7.4±n/a
Temperature
298.15±n/a K
Ki
2±n/a nM
Comments
extracted
Citation
 Vasudevan, APenning, TDChen, HLiang, BWang, SWu, FShen, YLiu, CZou, ZPliushchev, M Bicyclic carboxamide inhibitors of kinases US Patent  US9212192 Publication Date 12/15/2015 
Target
Name:
ALK tyrosine kinase receptor
Synonyms:
ALK ALK_HUMAN CD_antigen: CD246
Type:
Protein
Mol. Mass.:
176453.10
Organism:
Homo sapiens (Human)
Description:
Q9UM73
Residue:
1620
  
Inhibitor
Name:
BDBM196856
Synonyms:
US9212192, 19
Type:
Small organic molecule
Emp. Form.:
C25H26ClN7O2
Mol. Mass.:
491.973
SMILES:
COc1cc(ccc1Nc1nc(Cc2ccccc2Cl)n2ccnc2c1C(N)=O)N1CCNCC1
: