Target
Interleukin-1 receptor-associated kinase 4
Ligand
BDBM203492
Substrate
Meas. Tech.
IMAP technology (Molecular Devices)
pH
7.2±n/a
Temperature
298.15±n/a K
IC50
7.2±n/a nM
Comments
extracted
Citation
 Seganish, WMBrumfield, SNLim, JMatasi, JJMcElroy, WTTulshian, DBLavey, BJAltman, MDGibeau, CRLampe, JWMethot, JZhu, L Aminopyrimidinones as interleukin receptor-associated kinase inhibitors US Patent  US9221809 Publication Date 12/29/2015 
Target
Name:
Interleukin-1 receptor-associated kinase 4
Synonyms:
IRAK-4 IRAK4_HUMAN Interleukin-1 receptor-associated kinase 4 (IRAK4) | Renal carcinoma antigen NY-REN-64
Type:
Protein
Mol. Mass.:
51519.08
Organism:
Homo sapiens (Human)
Description:
Q9NWZ3
Residue:
460
  
Inhibitor
Name:
BDBM203492
Synonyms:
US9221809, 29 | US9221809, 65
Type:
Small organic molecule
Emp. Form.:
C26H27N5O4S
Mol. Mass.:
505.589
SMILES:
OC[C@H]1C[C@@H](Nc2nc([nH]c(=O)c2-c2nc3ccccc3s2)N2CCc3ccccc3C2)[C@H](O)[C@@H]1O
: