Target
Proto-oncogene tyrosine-protein kinase Src
Ligand
BDBM4394
Substrate
poly(E,Y)
Meas. Tech.
In Vitro Src Kinase Inhibition Test
pH
7.4±n/a
Temperature
295.15±n/a K
IC50
253±n/a nM
Citation
 Ple, PAGreen, TPHennequin, LFCurwen, JFennell, MAllen, JLambert-Van Der Brempt, CCostello, G Discovery of a new class of anilinoquinazoline inhibitors with high affinity and specificity for the tyrosine kinase domain of c-Src. J Med Chem 47:871-87 (2004)  
Target
Name:
Proto-oncogene tyrosine-protein kinase Src
Synonyms:
Calmodulin/Proto-oncogene tyrosine-protein kinase Src Proto-oncogene c-Src SRC SRC_HUMAN V-src sarcoma (Schmidt-Ruppin A-2) viral oncogene homolog (avian) p60-Src | pp60c-src
Type:
Protein
Mol. Mass.:
59838.60
Organism:
Homo sapiens (Human)
Description:
P12931
Residue:
536
  
Inhibitor
Name:
BDBM4394
Synonyms:
4-Anilidoquinazoline deriv. 9a Methoxy Aniline 1
Type:
Small organic molecule
Emp. Form.:
C17H17N3O3
Mol. Mass.:
311.3352
SMILES:
COc1cccc(Nc2ncnc3cc(OC)c(OC)cc23)c1
:
Substrate
Name:
poly(E,Y)
Synonyms:
Type:
Random Copolymer
Mol. Mass.:
358.43
Organism:
Description:
A poly(Glu,Tyr) 4:1 random copolymer. 10 uM ATP was used as co-substrate
Residue:
3
NA