Target
P2X purinoceptor 7
Ligand
BDBM242026
Substrate
Meas. Tech.
Fluorescent Imaging Plate Reader (FLIPR) Assay
pH
7.4±n/a
Temperature
310.15±n/a K
IC50
0.53±n/a nM
Comments
extracted
Citation
 Kilburn, JPRasmussen, LKJessing, MEldemenky, EMChen, BJiang, Y Cyclic amines US Patent  US9415055 Publication Date 8/16/2016 
Target
Name:
P2X purinoceptor 7
Synonyms:
ATP receptor P2RX7_HUMAN P2X purinoceptor 7 (P2X7) P2Z receptor | Purinergic receptor
Type:
Protein
Mol. Mass.:
68602.85
Organism:
Homo sapiens (Human)
Description:
Q99572
Residue:
595
  
Inhibitor
Name:
BDBM242026
Synonyms:
US9415055, 2-Chloro-N-[(S)-2-(4-chloro-phenyl)-2-morpholin-4-yl-ethyl]-3-methyl-benzamide | US9593105, 27
Type:
Small organic molecule
Emp. Form.:
C20H22Cl2N2O2
Mol. Mass.:
393.307
SMILES:
Cc1cccc(C(=O)NC[C@@H](N2CCOCC2)c2ccc(Cl)cc2)c1Cl
: