Target
P2X purinoceptor 7
Ligand
BDBM242166
Substrate
Meas. Tech.
Fluorescent Imaging Plate Reader (FLIPR) Assay
pH
7.4±n/a
Temperature
310.15±n/a K
IC50
38±n/a nM
Comments
extracted
Citation
 Kilburn, JPRasmussen, LKJessing, MEldemenky, EMChen, BJiang, Y Cyclic amines US Patent  US9415055 Publication Date 8/16/2016 
Target
Name:
P2X purinoceptor 7
Synonyms:
ATP receptor P2RX7_HUMAN P2X purinoceptor 7 (P2X7) P2Z receptor | Purinergic receptor
Type:
Protein
Mol. Mass.:
68602.85
Organism:
Homo sapiens (Human)
Description:
Q99572
Residue:
595
  
Inhibitor
Name:
BDBM242166
Synonyms:
US9415055, (-)2-chloro-N-[2-[2-(difluoromethyl)pyrimidin-5-yl]-2-morpholino-ethyl]-3-fluoro-benzamide | US9593105, 168
Type:
Small organic molecule
Emp. Form.:
C18H18ClF3N4O2
Mol. Mass.:
414.809
SMILES:
FC(F)c1ncc(cn1)C(CNC(=O)c1cccc(F)c1Cl)N1CCOCC1
: