Target
Bromodomain-containing protein 4 [1-477]
Ligand
BDBM445515
Substrate
Meas. Tech.
Time Resolved Fluorescence Resonance Energy Transfer (TR-FRET) Assay
IC50
<1±n/a nM
Citation
 Quesnelle, CAHarikrishnan, LSHill, MD Tricyclic compounds as anticancer agents US Patent  US10683290 Publication Date 6/16/2020 
Target
Name:
Bromodomain-containing protein 4 [1-477]
Synonyms:
BRD4 Bromodomain-containing protein 4 (BRD4)(1-477) | HUNK1
Type:
Enzyme Catalytic Domain
Mol. Mass.:
52863.68
Organism:
Homo sapiens (Human)
Description:
O60885[1-477]
Residue:
475
  
Inhibitor
Name:
BDBM445515
Synonyms:
2-[7-(Dimethyl-1H-1,2,3-triazol-5-yl)-9-fluoro-5-[(S)-oxan-4-yl(phenyl)methyl]-5H-pyrido[3,2-b]indol-3-yl]propan-2-ol | US10683290, Example 11
Type:
Small organic molecule
Emp. Form.:
C30H32FN5O2
Mol. Mass.:
513.6058
SMILES:
Cc1nnn(C)c1-c1cc(F)c2c(c1)n([C@@H](C1CCOCC1)c1ccccc1)c1cc(cnc21)C(C)(C)O
: