Target
Glycogen synthase kinase-3 beta
Ligand
BDBM7281
Substrate
GSK-3 Peptide Substrate
Meas. Tech.
Kinase Inhibition Assay
Temperature
303.15±n/a K
IC50
250±n/a nM
Comments
extracted
Citation
 Leost, MSchultz, CLink, AWu, YZBiernat, JMandelkow, EMBibb, JASnyder, GLGreengard, PZaharevitz, DWGussio, RSenderowicz, AMSausville, EAKunick, CMeijer, L Paullones are potent inhibitors of glycogen synthase kinase-3beta and cyclin-dependent kinase 5/p25. Eur J Biochem 267:5983-94 (2000)  
Target
Name:
Glycogen synthase kinase-3 beta
Synonyms:
GSK-3, beta Glycogen Synthase Kinase-3, beta | Gsk3b
Type:
Enzyme
Mol. Mass.:
46754.43
Organism:
Rattus norvegicus (rat)
Description:
The rat GSK-3 beta cDNA was inserted into the baculovirus vector. The protein was purified from virus-infected sf9 insect cells
Residue:
420
  
Inhibitor
Name:
BDBM7281
Synonyms:
2-iodopaullone NSC 707624 | Paullone Analog 20
Type:
Small organic molecule
Emp. Form.:
C16H11IN2O
Mol. Mass.:
374.1758
SMILES:
Ic1ccc2NC(=O)Cc3c([nH]c4ccccc34)-c2c1
:
Substrate
Name:
GSK-3 Peptide Substrate
Synonyms:
GS-1 Peptide | Phospho-GS2 Substrate Peptide
Type:
Peptide
Mol. Mass.:
3045.17
Organism:
Description:
Residue:
27