Target
Oxidized low-density lipoprotein receptor 1
Ligand
BDBM454208
Substrate
Meas. Tech.
Inhibition Assay
IC50
>300±n/a nM
Citation
 Findlay, ADTurner, CIDeodhar, MFoot, JSJarolimek, WZhou, WRobertson, AD Haloallylamine indole and azaindole derivative inhibitors of lysyl oxidases and uses thereof US Patent  US10717733 Publication Date 7/21/2020 
Target
Name:
Oxidized low-density lipoprotein receptor 1
Synonyms:
LOX-1 Lectin-like oxLDL receptor 1 Lectin-type oxidized LDL receptor 1 OLR1_BOVIN bLOX-1
Type:
Protein
Mol. Mass.:
30894.65
Organism:
Bovine
Description:
P79391
Residue:
270
  
Inhibitor
Name:
BDBM454208
Synonyms:
(Z)-3-fluoro-4-(3-(4-fluorophenyl)-1H- indol-1-yl)but-2-en-1-amine US11098045, Compound 1
Type:
Small organic molecule
Emp. Form.:
C18H16F2N2
Mol. Mass.:
298.3298
SMILES:
NC\C=C(/F)Cn1cc(-c2ccc(F)cc2)c2ccccc12
: