Target
Oxidized low-density lipoprotein receptor 1
Ligand
BDBM454210
Substrate
Meas. Tech.
Inhibition Assay
IC50
>300±n/a nM
Citation
 Findlay, ADTurner, CIDeodhar, MFoot, JSJarolimek, WZhou, WRobertson, AD Haloallylamine indole and azaindole derivative inhibitors of lysyl oxidases and uses thereof US Patent  US10717733 Publication Date 7/21/2020 
Target
Name:
Oxidized low-density lipoprotein receptor 1
Synonyms:
LOX-1 Lectin-like oxLDL receptor 1 Lectin-type oxidized LDL receptor 1 OLR1_BOVIN bLOX-1
Type:
Protein
Mol. Mass.:
30894.65
Organism:
Bovine
Description:
P79391
Residue:
270
  
Inhibitor
Name:
BDBM454210
Synonyms:
(Z)-4-(1-(4-amino-2-fluorobut-2-en-1-yl)- 2-methyl-1H-indol-3-yl)-N,N- dimethylbenzenesulfonamide US11098045, Compound 3
Type:
Small organic molecule
Emp. Form.:
C21H24FN3O2S
Mol. Mass.:
401.498
SMILES:
CN(C)S(=O)(=O)c1ccc(cc1)-c1c(C)n(C\C(F)=C\CN)c2ccccc12
: