Target
Oxidized low-density lipoprotein receptor 1
Ligand
BDBM454226
Substrate
Meas. Tech.
Inhibition Assay
IC50
>300±n/a nM
Citation
 Findlay, ADTurner, CIDeodhar, MFoot, JSJarolimek, WZhou, WRobertson, AD Haloallylamine indole and azaindole derivative inhibitors of lysyl oxidases and uses thereof US Patent  US10717733 Publication Date 7/21/2020 
Target
Name:
Oxidized low-density lipoprotein receptor 1
Synonyms:
LOX-1 Lectin-like oxLDL receptor 1 Lectin-type oxidized LDL receptor 1 OLR1_BOVIN bLOX-1
Type:
Protein
Mol. Mass.:
30894.65
Organism:
Bovine
Description:
P79391
Residue:
270
  
Inhibitor
Name:
BDBM454226
Synonyms:
(Z)-ethyl 1-(4-amino-2-fluorobut-2-en-1- yl)-3-(5-(N,N-dimethylsulfamoyl)-2- methylphenyl)-2-methyl-1H-indole-5- carboxylate US11098045, Compound 19
Type:
Small organic molecule
Emp. Form.:
C25H30FN3O4S
Mol. Mass.:
487.587
SMILES:
CCOC(=O)c1ccc2n(C\C(F)=C\CN)c(C)c(-c3cc(ccc3C)S(=O)(=O)N(C)C)c2c1
: