Target
Oxidized low-density lipoprotein receptor 1
Ligand
BDBM454235
Substrate
Meas. Tech.
Inhibition Assay
IC50
>300±n/a nM
Citation
 Findlay, ADTurner, CIDeodhar, MFoot, JSJarolimek, WZhou, WRobertson, AD Haloallylamine indole and azaindole derivative inhibitors of lysyl oxidases and uses thereof US Patent  US10717733 Publication Date 7/21/2020 
Target
Name:
Oxidized low-density lipoprotein receptor 1
Synonyms:
LOX-1 Lectin-like oxLDL receptor 1 Lectin-type oxidized LDL receptor 1 OLR1_BOVIN bLOX-1
Type:
Protein
Mol. Mass.:
30894.65
Organism:
Bovine
Description:
P79391
Residue:
270
  
Inhibitor
Name:
BDBM454235
Synonyms:
(Z)-1-(4-amino-2-fluorobut-2-en-1-yl)-3- (3-chlorophenyl)-2-methyl-1H-indole-5- carboxylic acid US11098045, Compound 28
Type:
Small organic molecule
Emp. Form.:
C20H18ClFN2O2
Mol. Mass.:
372.821
SMILES:
Cc1c(-c2cccc(Cl)c2)c2cc(ccc2n1C\C(F)=C\CN)C(O)=O
: