Target
Oxidized low-density lipoprotein receptor 1
Ligand
BDBM454241
Substrate
Meas. Tech.
Inhibition Assay
IC50
>300±n/a nM
Citation
 Findlay, ADTurner, CIDeodhar, MFoot, JSJarolimek, WZhou, WRobertson, AD Haloallylamine indole and azaindole derivative inhibitors of lysyl oxidases and uses thereof US Patent  US10717733 Publication Date 7/21/2020 
Target
Name:
Oxidized low-density lipoprotein receptor 1
Synonyms:
LOX-1 Lectin-like oxLDL receptor 1 Lectin-type oxidized LDL receptor 1 OLR1_BOVIN bLOX-1
Type:
Protein
Mol. Mass.:
30894.65
Organism:
Bovine
Description:
P79391
Residue:
270
  
Inhibitor
Name:
BDBM454241
Synonyms:
(Z)-3-(1-(4-amino-2-fluorobut-2-en-1-yl)- 5-(N,N-dimethylsulfamoyl)-2-methyl-1H- indol-3-yl)benzoic acid US11098045, Compound 34
Type:
Small organic molecule
Emp. Form.:
C22H24FN3O4S
Mol. Mass.:
445.507
SMILES:
CN(C)S(=O)(=O)c1ccc2n(C\C(F)=C\CN)c(C)c(-c3cccc(c3)C(O)=O)c2c1
: