Target
Oxidized low-density lipoprotein receptor 1
Ligand
BDBM454253
Substrate
Meas. Tech.
Inhibition Assay
IC50
>300±n/a nM
Citation
 Findlay, ADTurner, CIDeodhar, MFoot, JSJarolimek, WZhou, WRobertson, AD Haloallylamine indole and azaindole derivative inhibitors of lysyl oxidases and uses thereof US Patent  US10717733 Publication Date 7/21/2020 
Target
Name:
Oxidized low-density lipoprotein receptor 1
Synonyms:
LOX-1 Lectin-like oxLDL receptor 1 Lectin-type oxidized LDL receptor 1 OLR1_BOVIN bLOX-1
Type:
Protein
Mol. Mass.:
30894.65
Organism:
Bovine
Description:
P79391
Residue:
270
  
Inhibitor
Name:
BDBM454253
Synonyms:
(Z)-1-(4-amino-2-fluorobut-2-en-1-yl)-3- (3-(N,N-dimethylsulfamoyl)phenyl)-N,2- dimethyl-1H-pyrrolo[3,2-b]pyridine-5- carboxamide US11098045, Compound 46
Type:
Small organic molecule
Emp. Form.:
C22H26FN5O3S
Mol. Mass.:
459.537
SMILES:
CNC(=O)c1ccc2n(C\C(F)=C\CN)c(C)c(-c3cccc(c3)S(=O)(=O)N(C)C)c2n1
: