Target
P2X purinoceptor 7
Ligand
BDBM242021
Substrate
Meas. Tech.
Binding Assay
IC50
0.62±n/a nM
Citation
 Kilburn, JPRasmussen, LKJessing, MEldemenky, EMChen, BJiang, Y Cyclic amines US Patent  US9593105 Publication Date 3/14/2017 
Target
Name:
P2X purinoceptor 7
Synonyms:
ATP receptor P2RX7_HUMAN P2X purinoceptor 7 (P2X7) P2Z receptor | Purinergic receptor
Type:
Protein
Mol. Mass.:
68602.85
Organism:
Homo sapiens (Human)
Description:
Q99572
Residue:
595
  
Inhibitor
Name:
BDBM242021
Synonyms:
US9415055, 2,3-Dichloro-N-[(S)-2-(4-chloro-phenyl)-2-morpholin-4-yl-ethyl]benzamide | US9593105, 23
Type:
Small organic molecule
Emp. Form.:
C19H19Cl3N2O2
Mol. Mass.:
413.725
SMILES:
Clc1ccc(cc1)[C@@H](CNC(=O)c1cccc(Cl)c1Cl)N1CCOCC1
: