Target
PAS domain-containing serine/threonine-protein kinase
Ligand
BDBM463501
Substrate
Meas. Tech.
Radiochemical Assay
IC50
<1000±n/a nM
Citation
 McCall, JMRomero, DLMcKearn, JClare, M Heterocyclic compounds for the inhibition of PASK US Patent  US10781185 Publication Date 9/22/2020 
Target
Name:
PAS domain-containing serine/threonine-protein kinase
Synonyms:
KIAA0135 PASK PASK_HUMAN | hPASK
Type:
PROTEIN
Mol. Mass.:
142867.26
Organism:
Homo sapiens (Human)
Description:
ChEMBL_944230
Residue:
1323
  
Inhibitor
Name:
BDBM463501
Synonyms:
2-(1H-Indol-5-yl)-3-(isopropyl(methyl)amino)quinoxaline-6-carboxylic acid US11459307, Example 84
Type:
Small organic molecule
Emp. Form.:
C21H20N4O2
Mol. Mass.:
360.4091
SMILES:
CC(C)N(C)c1nc2cc(ccc2nc1-c1ccc2[nH]ccc2c1)C(O)=O
: