Target
PAS domain-containing serine/threonine-protein kinase
Ligand
BDBM463513
Substrate
Meas. Tech.
FRET Assay
IC50
<1000±n/a nM
Citation
 McCall, JMRomero, DLMcKearn, JClare, M Heterocyclic compounds for the inhibition of PASK US Patent  US10781185 Publication Date 9/22/2020 
Target
Name:
PAS domain-containing serine/threonine-protein kinase
Synonyms:
KIAA0135 PASK PASK_HUMAN | hPASK
Type:
PROTEIN
Mol. Mass.:
142867.26
Organism:
Homo sapiens (Human)
Description:
ChEMBL_944230
Residue:
1323
  
Inhibitor
Name:
BDBM463513
Synonyms:
3-(Methyl(phenethyl)amino)-2-phenylquinoxaline-6-carboxylic acid US11459307, Example 42
Type:
Small organic molecule
Emp. Form.:
C24H21N3O2
Mol. Mass.:
383.4424
SMILES:
CN(CCc1ccccc1)c1nc2cc(ccc2nc1-c1ccccc1)C(O)=O
: