Target
PAS domain-containing serine/threonine-protein kinase
Ligand
BDBM463536
Substrate
Meas. Tech.
FRET Assay
IC50
<1000±n/a nM
Citation
 McCall, JMRomero, DLMcKearn, JClare, M Heterocyclic compounds for the inhibition of PASK US Patent  US10781185 Publication Date 9/22/2020 
Target
Name:
PAS domain-containing serine/threonine-protein kinase
Synonyms:
KIAA0135 PASK PASK_HUMAN | hPASK
Type:
PROTEIN
Mol. Mass.:
142867.26
Organism:
Homo sapiens (Human)
Description:
ChEMBL_944230
Residue:
1323
  
Inhibitor
Name:
BDBM463536
Synonyms:
(S)-2-(4-Fluorophenyl)-3-(2-methyl-4-(pyridin-2-yl)piperazin-1-yl)quinoxaline-6-carboxylic acid US11459307, Example 90
Type:
Small organic molecule
Emp. Form.:
C25H22FN5O2
Mol. Mass.:
443.4729
SMILES:
C[C@H]1CN(CCN1c1nc2cc(ccc2nc1-c1ccc(F)cc1)C(O)=O)c1ccccn1
: