Target
PAS domain-containing serine/threonine-protein kinase
Ligand
BDBM463537
Substrate
Meas. Tech.
FRET Assay
IC50
<1000±n/a nM
Citation
 McCall, JMRomero, DLMcKearn, JClare, M Heterocyclic compounds for the inhibition of PASK US Patent  US10781185 Publication Date 9/22/2020 
Target
Name:
PAS domain-containing serine/threonine-protein kinase
Synonyms:
KIAA0135 PASK PASK_HUMAN | hPASK
Type:
PROTEIN
Mol. Mass.:
142867.26
Organism:
Homo sapiens (Human)
Description:
ChEMBL_944230
Residue:
1323
  
Inhibitor
Name:
BDBM463537
Synonyms:
(S)-2-(4-Fluorophenyl)-3-(2-methylpiperidin-1-yl)quinoxaline-6-carboxylic acid F US11459307, Example 91
Type:
Small organic molecule
Emp. Form.:
C21H20FN3O2
Mol. Mass.:
365.4008
SMILES:
C[C@H]1CCCCN1c1nc2cc(ccc2nc1-c1ccc(F)cc1)C(O)=O
: