Target
PAS domain-containing serine/threonine-protein kinase
Ligand
BDBM463538
Substrate
Meas. Tech.
FRET Assay
IC50
<1000±n/a nM
Citation
 McCall, JMRomero, DLMcKearn, JClare, M Heterocyclic compounds for the inhibition of PASK US Patent  US10781185 Publication Date 9/22/2020 
Target
Name:
PAS domain-containing serine/threonine-protein kinase
Synonyms:
KIAA0135 PASK PASK_HUMAN | hPASK
Type:
PROTEIN
Mol. Mass.:
142867.26
Organism:
Homo sapiens (Human)
Description:
ChEMBL_944230
Residue:
1323
  
Inhibitor
Name:
BDBM463538
Synonyms:
3-(Cyclopropyl(methyl)amino)-2-(4-fluorophenyl)quinoxaline-6-carboxylic acid F US11459307, Example 92
Type:
Small organic molecule
Emp. Form.:
C19H16FN3O2
Mol. Mass.:
337.3476
SMILES:
CN(C1CC1)c1nc2cc(ccc2nc1-c1ccc(F)cc1)C(O)=O
: