Target
PAS domain-containing serine/threonine-protein kinase
Ligand
BDBM463540
Substrate
Meas. Tech.
FRET Assay
IC50
<1000±n/a nM
Citation
 McCall, JMRomero, DLMcKearn, JClare, M Heterocyclic compounds for the inhibition of PASK US Patent  US10781185 Publication Date 9/22/2020 
Target
Name:
PAS domain-containing serine/threonine-protein kinase
Synonyms:
KIAA0135 PASK PASK_HUMAN | hPASK
Type:
PROTEIN
Mol. Mass.:
142867.26
Organism:
Homo sapiens (Human)
Description:
ChEMBL_944230
Residue:
1323
  
Inhibitor
Name:
BDBM463540
Synonyms:
(S)-3-(2-Methyl-4-(pyridin-2-yl)piperazin-1-yl)-2-phenylquinoxaline-6-carboxylic acid US11459307, Example 94
Type:
Small organic molecule
Emp. Form.:
C25H23N5O2
Mol. Mass.:
425.4824
SMILES:
C[C@H]1CN(CCN1c1nc2cc(ccc2nc1-c1ccccc1)C(O)=O)c1ccccn1
: