Target
PAS domain-containing serine/threonine-protein kinase
Ligand
BDBM463548
Substrate
Meas. Tech.
FRET Assay
IC50
>1000±n/a nM
Citation
 McCall, JMRomero, DLMcKearn, JClare, M Heterocyclic compounds for the inhibition of PASK US Patent  US10781185 Publication Date 9/22/2020 
Target
Name:
PAS domain-containing serine/threonine-protein kinase
Synonyms:
KIAA0135 PASK PASK_HUMAN | hPASK
Type:
PROTEIN
Mol. Mass.:
142867.26
Organism:
Homo sapiens (Human)
Description:
ChEMBL_944230
Residue:
1323
  
Inhibitor
Name:
BDBM463548
Synonyms:
3-(1,1-Dioxidothiomorpholino)-2-phenylquinoxaline-6-carboxylic acid US11459307, Example 102
Type:
Small organic molecule
Emp. Form.:
C19H17N3O4S
Mol. Mass.:
383.421
SMILES:
OC(=O)c1ccc2nc(-c3ccccc3)c(nc2c1)N1CCS(=O)(=O)CC1
: