Target
PAS domain-containing serine/threonine-protein kinase
Ligand
BDBM463549
Substrate
Meas. Tech.
FRET Assay
IC50
<1000±n/a nM
Citation
 McCall, JMRomero, DLMcKearn, JClare, M Heterocyclic compounds for the inhibition of PASK US Patent  US10781185 Publication Date 9/22/2020 
Target
Name:
PAS domain-containing serine/threonine-protein kinase
Synonyms:
KIAA0135 PASK PASK_HUMAN | hPASK
Type:
PROTEIN
Mol. Mass.:
142867.26
Organism:
Homo sapiens (Human)
Description:
ChEMBL_944230
Residue:
1323
  
Inhibitor
Name:
BDBM463549
Synonyms:
2-(4-Fluorophenyl)-3-(3-oxopiperazin-1-yl)quinoxaline-6-carboxylic acid US11459307, Example 103
Type:
Small organic molecule
Emp. Form.:
C19H15FN4O3
Mol. Mass.:
366.3458
SMILES:
OC(=O)c1ccc2nc(-c3ccc(F)cc3)c(nc2c1)N1CCNC(=O)C1
: