Target
Glycogen synthase kinase-3 beta [7-25]
Ligand
BDBM7822
Substrate
GSK-3 Peptide Substrate
Meas. Tech.
Kinase Inhibition Assay
Temperature
310.15±n/a K
IC50
100000±n/a nM
Comments
extracted
Citation
 Martinez, AAlonso, MCastro, ADorronsoro, IGelpi, JLLuque, FJPerez, CMoreno, FJ SAR and 3D-QSAR studies on thiadiazolidinone derivatives: exploration of structural requirements for glycogen synthase kinase 3 inhibitors. J Med Chem 48:7103-12 (2005)  
Target
Name:
Glycogen synthase kinase-3 beta [7-25]
Synonyms:
G1T8E2_RABIT GSK3B | Glycogen Synthase Kinase-3, beta
Type:
Enzyme fragment
Mol. Mass.:
1972.14
Organism:
Oryctolagus cuniculus (rabbit)
Description:
Glycogen Synthase Kinase-3 is the beta isoform of the rabbit enzyme produced in E.coli.. Only partial sequence is available.
Residue:
19
TTSFAESCKPVQQPSAFGS
  
Inhibitor
Name:
BDBM7822
Synonyms:
1,3-thiazolidine-2,4-dione thiazolidinedione deriv. 21
Type:
Small organic molecule
Emp. Form.:
C3H3NO2S
Mol. Mass.:
117.126
SMILES:
Oc1csc(=O)[nH]1
:
Substrate
Name:
GSK-3 Peptide Substrate
Synonyms:
GS-1 Peptide | Phospho-GS2 Substrate Peptide
Type:
Peptide
Mol. Mass.:
3045.17
Organism:
Description:
Residue:
27