Target
Cyclin-dependent kinase 3/G1/S-specific cyclin-E1
Ligand
BDBM59227
Substrate
Meas. Tech.
In Vitro Kinase Assay
IC50
9±n/a nM
Citation
 Caligiuri, MBecker, FMurthi, KKaplan, FDedier, SKaufmann, CMachl, AZybarth, GRichard, JBockovich, NKluge, AKley, N A proteome-wide CDK/CRK-specific kinase inhibitor promotes tumor cell death in the absence of cell cycle progression. Chem Biol 12:1103-15 (2005)  
Target
Name:
Cyclin-dependent kinase 3/G1/S-specific cyclin-E1
Synonyms:
CDK3/Cyclin E | CDK3/E
Type:
Protein
Mol. Mass.:
Description:
Components:
This complex has 2 components.
Component 1
Name:
Cyclin-dependent kinase 3
Synonyms:
CDK3 CDK3_HUMAN Cyclin-dependent kinase 3 | Cyclin-dependent kinase 3 (CDK3)
Type:
Enzyme
Mol. Mass.:
35053.88
Organism:
Homo sapiens (Human)
Description:
Q00526
Residue:
305
  
Component 2
Name:
G1/S-specific cyclin-E1
Synonyms:
CCNE CCNE1_HUMAN
Type:
Enzyme Subunit
Mol. Mass.:
47073.17
Organism:
Homo sapiens (Human)
Description:
Residue:
410
  
Inhibitor
Name:
BDBM59227
Synonyms:
Pyrazolopyrimidone analog, RGB-286147
Type:
Small organic molecule
Emp. Form.:
C23H22Cl2N4O3
Mol. Mass.:
473.352
SMILES:
CC(C)c1nn(-c2c(Cl)cccc2Cl)c2nc(Cc3ccc(OCCO)cc3)[nH]c(=O)c12
: