Target
Type-1 angiotensin II receptor
Ligand
BDBM50038190
Substrate
Meas. Tech.
ChEMBL_36635 (CHEMBL652346)
IC50
0.210000±n/a nM
Citation
 Chakravarty, PKNaylor, EMChen, AChang, RSChen, TBFaust, KALotti, VJKivlighn, SDGable, RAZingaro, GJ A highly potent, orally active imidazo[4,5-b]pyridine biphenylacylsulfonamide (MK-996; L-159,282): a new AT1-selective angiotensin II receptor antagonist. J Med Chem 37:4068-72 (1995)  
Target
Name:
Type-1 angiotensin II receptor
Synonyms:
AGTR1 ANGIOTENSIN AT1 Angiotensin II type 1a (AT-1a) receptor
Type:
Enzyme Catalytic Domain
Mol. Mass.:
41009.15
Organism:
RABBIT
Description:
ANGIOTENSIN AT1 AGTR1 RABBIT::P34976
Residue:
359
  
Inhibitor
Name:
BDBM50038190
Synonyms:
4'-(2-Ethyl-5,7-dimethyl-imidazo[4,5-b]pyridin-3-ylmethyl)-biphenyl-2-sulfonic acid isobutyryl-amide | CHEMBL335778
Type:
Small organic molecule
Emp. Form.:
C27H30N4O3S
Mol. Mass.:
490.617
SMILES:
CCc1nc2c(C)cc(C)nc2n1Cc1ccc(cc1)-c1ccccc1S(=O)(=O)NC(=O)C(C)C
: