Target
Type-1 angiotensin II receptor
Ligand
BDBM50047849
Substrate
Meas. Tech.
ChEMBL_36941 (CHEMBL648844)
IC50
55±n/a nM
Citation
 Ashton, WTCantone, CLChang, LLHutchins, SMStrelitz, RAMacCoss, MChang, RSLotti, VJFaust, KAChen, TB Nonpeptide angiotensin II antagonists derived from 4H-1,2,4-triazoles and 3H-imidazo[1,2-b][1,2,4]triazoles. J Med Chem 36:591-609 (1993)  
Target
Name:
Type-1 angiotensin II receptor
Synonyms:
AGTR1 ANGIOTENSIN AT1 Angiotensin II type 1a (AT-1a) receptor
Type:
Enzyme Catalytic Domain
Mol. Mass.:
41009.15
Organism:
RABBIT
Description:
ANGIOTENSIN AT1 AGTR1 RABBIT::P34976
Residue:
359
  
Inhibitor
Name:
BDBM50047849
Synonyms:
2-Butyl-5-methyl-3-[2'-(1H-tetrazol-5-yl)-biphenyl-4-ylmethyl]-3H-imidazo[1,2-b][1,2,4]triazole | CHEMBL155305
Type:
Small organic molecule
Emp. Form.:
C23H24N8
Mol. Mass.:
412.4903
SMILES:
CCCCc1nn2cc(C)nc2n1Cc1ccc(cc1)-c1ccccc1-c1nnn[nH]1
: