Target
Thrombopoietin receptor
Ligand
BDBM50105943
Substrate
Meas. Tech.
ChEMBL_207477 (CHEMBL815867)
EC50
>30000±n/a nM
Citation
 Duffy, KJDarcy, MGDelorme, EDillon, SBEppley, DFErickson-Miller, CGiampa, LHopson, CBHuang, YKeenan, RMLamb, PLeong, LLiu, NMiller, SGPrice, ATRosen, JShah, RShaw, TNSmith, HStark, KCTian, SSTyree, CWiggall, KJZhang, LLuengo, JI Hydrazinonaphthalene and azonaphthalene thrombopoietin mimics are nonpeptidyl promoters of megakaryocytopoiesis. J Med Chem 44:3730-45 (2001)  
Target
Name:
Thrombopoietin receptor
Synonyms:
C-mpl MPL TPO-R TPOR_HUMAN
Type:
PROTEIN
Mol. Mass.:
71243.48
Organism:
Homo sapiens (Human)
Description:
ChEMBL_535587
Residue:
635
  
Inhibitor
Name:
BDBM50105943
Synonyms:
4-[N'-(1-Benzyl-3-methyl-5-oxo-1,5-dihydro-pyrazol-4-ylidene)-hydrazino]-3-hydroxy-naphthalene-1-sulfonic acid | CHEMBL122503
Type:
Small organic molecule
Emp. Form.:
C21H18N4O5S
Mol. Mass.:
438.456
SMILES:
Cc1[nH]n(Cc2ccccc2)c(=O)c1N=Nc1c(O)cc(c2ccccc12)S(O)(=O)=O
: