Target
Thrombopoietin receptor
Ligand
BDBM50105954
Substrate
Meas. Tech.
ChEMBL_207477 (CHEMBL815867)
EC50
200±n/a nM
Citation
 Duffy, KJDarcy, MGDelorme, EDillon, SBEppley, DFErickson-Miller, CGiampa, LHopson, CBHuang, YKeenan, RMLamb, PLeong, LLiu, NMiller, SGPrice, ATRosen, JShah, RShaw, TNSmith, HStark, KCTian, SSTyree, CWiggall, KJZhang, LLuengo, JI Hydrazinonaphthalene and azonaphthalene thrombopoietin mimics are nonpeptidyl promoters of megakaryocytopoiesis. J Med Chem 44:3730-45 (2001)  
Target
Name:
Thrombopoietin receptor
Synonyms:
C-mpl MPL TPO-R TPOR_HUMAN
Type:
PROTEIN
Mol. Mass.:
71243.48
Organism:
Homo sapiens (Human)
Description:
ChEMBL_535587
Residue:
635
  
Inhibitor
Name:
BDBM50105954
Synonyms:
1-(4-tert-Butyl-phenyl)-4-[(2-hydroxy-4-sulfo-naphthalen-1-yl)-hydrazono]-5-oxo-4,5-dihydro-1H-pyrazole-3-carboxylic acid tert-butyl ester | CHEMBL125777
Type:
Small organic molecule
Emp. Form.:
C28H30N4O7S
Mol. Mass.:
566.625
SMILES:
CC(C)(C)OC(=O)c1[nH]n(-c2ccc(cc2)C(C)(C)C)c(=O)c1N=Nc1c(O)cc(c2ccccc12)S(O)(=O)=O
: