Target
Disintegrin and metalloproteinase domain-containing protein 17
Ligand
BDBM50113039
Substrate
Meas. Tech.
ChEMBL_212741 (CHEMBL816559)
IC50
11±n/a nM
Citation
 Letavic, MAAxt, MZBarberia, JTCarty, TJDanley, DEGeoghegan, KFHalim, NSHoth, LRKamath, AVLaird, ERLopresti-Morrow, LLMcClure, KFMitchell, PGNatarajan, VNoe, MCPandit, JReeves, LSchulte, GKSnow, SLSweeney, FJTan, DHYu, CH Synthesis and biological activity of selective pipecolic acid-based TNF-alpha converting enzyme (TACE) inhibitors. Bioorg Med Chem Lett 12:1387-90 (2002)  
Target
Name:
Disintegrin and metalloproteinase domain-containing protein 17
Synonyms:
ADA17_HUMAN CSVP Disintegrin and metalloproteinase domain-containing protein 17 (ADAM17) TNF-alpha convertase TNF-alpha-converting enzyme (TACE) Tumor necrosis factor-α converting enzyme (TACE)
Type:
Enzyme
Mol. Mass.:
93007.89
Organism:
Homo sapiens (Human)
Description:
Residue:
824
  
Inhibitor
Name:
BDBM50113039
Synonyms:
(2R,5R)-5-Hydroxy-1-[4-(2-isopropyl-benzyloxy)-benzenesulfonyl]-piperidine-2-carboxylic acid hydroxyamide | CHEMBL29068
Type:
Small organic molecule
Emp. Form.:
C22H28N2O6S
Mol. Mass.:
448.533
SMILES:
CC(C)c1ccccc1COc1ccc(cc1)S(=O)(=O)N1C[C@H](O)CC[C@@H]1C(=O)NO
: