Target
Aldo-keto reductase family 1 member B1
Ligand
BDBM50136853
Substrate
Meas. Tech.
ChEMBL_31909 (CHEMBL642953)
IC50
227000±n/a nM
Citation
 Sun, WSPark, YSYoo, JPark, KDKim, SHKim, JHPark, HJ Rational design of an indolebutanoic acid derivative as a novel aldose reductase inhibitor based on docking and 3D QSAR studies of phenethylamine derivatives. J Med Chem 46:5619-27 (2003)  
Target
Name:
Aldo-keto reductase family 1 member B1
Synonyms:
AKR1B1 ALR2 Aldose reductase
Type:
PROTEIN
Mol. Mass.:
35865.31
Organism:
Sus scrofa
Description:
ChEMBL_502637
Residue:
316
  
Inhibitor
Name:
BDBM50136853
Synonyms:
CHEMBL86532 | N-Phenyl-phthalamic acid
Type:
Small organic molecule
Emp. Form.:
C14H11NO3
Mol. Mass.:
241.242
SMILES:
OC(=O)c1ccccc1C(=O)Nc1ccccc1
: