Target
Follicle-stimulating hormone receptor
Ligand
BDBM50410295
Substrate
Meas. Tech.
ChEMBL_312853 (CHEMBL874932)
IC50
2800±n/a nM
Citation
 van Straten, NCvan Berkel, THDemont, DRKarstens, WJMerkx, ROosterom, JSchulz, Jvan Someren, RGTimmers, CMvan Zandvoort, PM Identification of substituted 6-amino-4-phenyltetrahydroquinoline derivatives: potent antagonists for the follicle-stimulating hormone receptor. J Med Chem 48:1697-700 (2005)  
Target
Name:
Follicle-stimulating hormone receptor
Synonyms:
FSH-R FSHR_HUMAN Follicle-stimulating hormone receptor LGR1
Type:
PROTEIN
Mol. Mass.:
78273.21
Organism:
Homo sapiens (Human)
Description:
ChEMBL_1351769
Residue:
695
  
Inhibitor
Name:
BDBM50410295
Synonyms:
CHEMBL371595
Type:
Small organic molecule
Emp. Form.:
C27H30N2O3S
Mol. Mass.:
462.604
SMILES:
CC(=O)N1c2ccc(NS(=O)(=O)Cc3ccccc3)cc2C(C)(CC1(C)C)c1ccccc1
: