Target
Amyloid-beta precursor protein
Ligand
BDBM50220285
Substrate
Meas. Tech.
ChEMBL_449195 (CHEMBL899460)
IC50
32±n/a nM
Citation
 Josien, HBara, TRajagopalan, MAsberom, TClader, JWFavreau, LGreenlee, WJHyde, LANomeir, AAParker, EMPissarnitski, DASong, LWong, GTZhang, LZhang, QZhao, Z Small conformationally restricted piperidine N-arylsulfonamides as orally active gamma-secretase inhibitors. Bioorg Med Chem Lett 17:5330-5 (2007)  
Target
Name:
Amyloid-beta precursor protein
Synonyms:
A4 ABPP AICD-50 AICD-59 AID(57) APP Alzheimer disease amyloid protein Amyloid beta Protein Amyloid beta protein Abeta(1-42) Amyloid intracellular domain 57 Amyloid protein (Abeta42b) Beta amyloid A4 protein Beta-APP42 Beta-amyloid protein 42 C83 CVAP Gamma Secretase Gamma-CTF(57) Gamma-secretase Gamma-secretase C-terminal fragment 57 P3(40) PN-II Protease nexin-II S-APP-beta Soluble APP-beta | beta-Amyloid Precursor Protein (APP)
Type:
Single-pass type I membrane protein
Mol. Mass.:
86890.41
Organism:
Homo sapiens (Human)
Description:
P05067
Residue:
770
  
Inhibitor
Name:
BDBM50220285
Synonyms:
1-((2R,6S)-1-(4-chlorophenylsulfonyl)-6-cyclopropylpiperidin-2-yl)cyclopropyl 4-(3-hydroxypropyl)piperazine-1-carboxylate | CHEMBL236192
Type:
Small organic molecule
Emp. Form.:
C25H36ClN3O5S
Mol. Mass.:
526.088
SMILES:
OCCCN1CCN(CC1)C(=O)OC1(CC1)[C@H]1CCC[C@@H](C2CC2)N1S(=O)(=O)c1ccc(Cl)cc1
: