Target
5-hydroxytryptamine receptor 1B
Ligand
BDBM50243699
Substrate
Meas. Tech.
ChEMBL_554186 (CHEMBL963643)
Ki
60±n/a nM
Citation
 Pelletier, JCChengalvala, MCottom, JFeingold, IGarrick, LGreen, DHauze, DHuselton, CJetter, JKao, WKopf, GSLundquist, JTMann, CMehlmann, JRogers, JShanno, LWrobel, J 2-phenyl-4-piperazinylbenzimidazoles: orally active inhibitors of the gonadotropin releasing hormone (GnRH) receptor. Bioorg Med Chem 16:6617-40 (2008)  
Target
Name:
5-hydroxytryptamine receptor 1B
Synonyms:
5-HT-1B 5-HT1B 5HT1B_HUMAN HTR1DB Serotonin (5-HT) receptor Serotonin Receptor 1B
Type:
G Protein-Coupled Receptor (GPCR)
Mol. Mass.:
43579.17
Organism:
Homo sapiens (Human)
Description:
Receptor binding assays were performed using human clone stably expressed in CHO cells
Residue:
390
  
Inhibitor
Name:
BDBM50243699
Synonyms:
2-(trifluoromethyl)-7-(2-(4-(2-(trifluoromethyl)-1H-benzo[d]imidazol-4-yl)piperazin-1-yl)ethoxy)-1H-benzo[d]imidazole | CHEMBL472117
Type:
Small organic molecule
Emp. Form.:
C22H20F6N6O
Mol. Mass.:
498.4242
SMILES:
FC(F)(F)c1nc2cccc(OCCN3CCN(CC3)c3cccc4[nH]c(nc34)C(F)(F)F)c2[nH]1
: