Target
Serine/threonine-protein kinase PLK4
Ligand
BDBM50243980
Substrate
Meas. Tech.
ChEMBL_555008 (CHEMBL957983)
IC50
9200±n/a nM
Citation
 Peifer, CSelig, RKinkel, KOtt, DTotzke, FSchächtele, CHeidenreich, RRöcken, MSchollmeyer, DLaufer, S Design, synthesis, and biological evaluation of novel 3-aryl-4-(1H-indole-3yl)-1,5-dihydro-2H-pyrrole-2-ones as vascular endothelial growth factor receptor (VEGF-R) inhibitors. J Med Chem 51:3814-24 (2008)  
Target
Name:
Serine/threonine-protein kinase PLK4
Synonyms:
PLK4 Polo-Like Kinase 4 STK18 | Serine/threonine-protein kinase PLK4
Type:
PROTEIN
Mol. Mass.:
108996.91
Organism:
Homo sapiens (Human)
Description:
ChEMBL_1474078
Residue:
970
  
Inhibitor
Name:
BDBM50243980
Synonyms:
3-(N-Methyl-1H-indol-3-yl)-4-(3,4,5-trimethoxyphenyl)-1,5-dihydro-2H-pyrrole-2-one | CHEMBL509435
Type:
Small organic molecule
Emp. Form.:
C22H22N2O4
Mol. Mass.:
378.4211
SMILES:
COc1cc(cc(OC)c1OC)C1=C(C(=O)NC1)c1cn(C)c2ccccc12
: